{"text_format":"1","workbook":"xlsx","n_sheets":6,"sheets":["DPIA Main","DPIA Measure Catalog","DPIA Risk Catalog","FAQ","Config","Changelog"],"not_rendered":{"charts":0,"images":4,"macros":1,"external_links":0,"defined_names":7,"comments":0,"pivot_tables":0},"unopened":[],"bounds":{"document_bytes":16777216,"sheet_cells":100000,"rows_first":2000,"rows_last":500,"rows_between":2000,"halvings":0,"cell_chars":16384,"cell_head_chars":4096},"cells_cut":0,"cells_raw":0,"read":"whole","date_system":"1900"}

{"sheet":"DPIA Main","index":0,"n_rows":222,"n_cols":20,"rows_kept":222,"cut":false,"hidden":false,"merged":[[214,12,217,12],[215,0,215,5],[125,5,126,5],[207,2,207,5],[204,2,204,5],[210,2,210,5],[214,0,214,6],[177,1,178,1],[179,1,180,1],[181,1,182,1],[177,3,177,6],[178,3,178,6],[179,3,179,6],[217,0,217,6],[181,3,181,6],[182,3,182,6],[218,0,218,6],[0,0,0,1],[6,2,6,3],[5,2,5,3],[205,2,205,5],[206,2,206,5],[23,2,23,5],[24,2,24,5],[25,2,25,5],[29,2,29,5],[30,2,30,5],[7,2,7,3],[8,2,8,3],[21,2,21,5],[1,0,1,1],[17,2,17,5],[18,2,18,5],[20,2,20,5],[180,3,180,6],[3,8,3,10],[12,2,12,3],[3,0,3,5],[10,2,10,3],[16,2,16,5],[19,2,19,5],[22,2,22,5],[171,1,172,1],[121,12,125,12],[125,4,126,4],[37,12,40,12],[35,12,36,12],[39,3,41,4],[189,2,189,3],[190,2,190,3],[191,2,191,3],[192,2,192,3],[193,2,193,3],[194,2,194,3],[195,2,195,3],[196,2,196,3],[197,2,197,3],[198,2,198,3]]}
["Data Protection Impact Assessment (DPIA)",null,{"$f":"_xlfn.CONCAT($B$128:$B$168)","v":"Personal data used in the project is leaked due to an error or intentionally to unauthorized third parties. They misuse it to the detriment of the affected individuals.Personal data used in the project is leaked due to an error or intentionally to an unauthorized internal person. This person misuses it to the detriment of the affected individuals.Personal data used in the project is accidentally deleted in whole or in part. This leads to a disadvantage for the affected individuals.Personal data used in the project is partially or completely deleted by an attacker. This leads to a disadvantage for the affected individuals.The solution or the systems with which we process the personal data used in the project no longer allows us to access or otherwise process the data. This leads to a disadvantage for the affected individuals.Personal data used in the project is manipulated by an external attacker, which we do not immediately notice and which in turn leads to a disadvantage for the affected individuals.Personal data used in the project is manipulated by an internal attacker, which we do not immediately notice and which in turn leads to a disadvantage for the affected individuals.Personal data used in the project is not updated due to an error in the solution, system, or operation, partially deleted or otherwise falsified, which we do not notice immediately and which in turn leads to a disadvantage for the affected persons.The affected individuals do not realize that we are collecting their personal data or what we are doing with it. This lack of transparency leads to distrust and discomfort among these individuals and other disadvantages for them.Personal data used in the project is misused by us compared to our original communication, which leads to distrust and discomfort by the affected persons and other disadvantages for them.Personal data used in the project is used contrary to applicable rules by a third party for purposes other than intended, which leads to distrust and discomfort by the affected persons and other disadvantages for them.We are unable to satisfy an affected individual's access right, i.e. the information about their relevant personal data and the other aspects of data processing that they may ask us about or request. As a result, they cannot properly enforce their legal rights to ensure their data protection.We are unable to delete the data of an affected individual at its request, even though we should do so. This leads to discomfort among the affected individuals and other disadvantages for them.We are unable to correct the data of an affected individual at ist request, even though we should do this. This leads to discomfort of the affected individuals and other disadvantages for them, because we process incorrect or incomplete data about them.We are unable to delete the personal data no longer needed. This leads to such data being misused to the detriment of the affected individuals or they can fall into the hands of unauthorized persons, with all the consequences of such an incident.Our data processing has errors or gaps. This leads to affected individuals suffering financial losses or disadvantages.Our data processing has errors or gaps. This leads to services being denied to affected individuals in an unintended manner."},{"$f":"ROW($B$128)+((MAX($A$127:$A$168)-4)*100)","v":144.99999999999963},{"$f":"ROW($B$46)","v":46},{"$f":"\"What is planned: \"&$C$18&\"\\n Business process or business area: \"&$C$17&\"\\n What objectives and interests are being pursued: \"&$C$19&\"\\n Data subjects: \"&$C$23&\"\\n Categories of data: \"&$C$22&\"\\n Means and techniques used: \"&$C$20&\"\\n Entities and providers involved: \"&$C$21&\"\\n Data processing locations: \"&$C$24&\"\\n Special aspects: \"&$C$26","v":"What is planned: This is about voice recognition: All conversations are recorded and processed by AI. The voice print is then stored in a database. With each call, a new voice print is created and this is compared with the stored voice print. The call center agent is shown if it matches.\\n Business process or business area: Handling calls in the call center\\n What objectives and interests are being pursued: The voice print is intended to help the call center agent verify the identity of a caller to the call center and thus increase security.\\n Data subjects: Caller\\n Categories of data: Voiceprint, a person's ID, voice recordings\\n Means and techniques used: A standard solution from the US manufacturer StarVoice Inc. is used, which we operate in the cloud here in Switzerland.\\n Entities and providers involved: The solution runs on Microsoft Azure by Microsoft Ireland Operations Ltd. Other third parties are not involved.\\n Data processing locations: Switzerland\\n Special aspects: "},{"$f":"$C$18&\"(\"&$C$17&\")\"","v":"This is about voice recognition: All conversations are recorded and processed by AI. The voice print is then stored in a database. With each call, a new voice print is created and this is compared with the stored voice print. The call center agent is shown if it matches.(Handling calls in the call center)"},{"$f":"ROW($B$89)","v":89}]
["Version 22.9.2024 - Private Sector CH-FADP/GDPR",null,{"$f":"_xlfn.CONCAT($G$46:$G$83)&_xlfn.CONCAT($G$89:$G$117)","v":"Training: We train the correct use of the solution to reduce the risk of errors in the processing of personal data./nUser Manual: We provide the employees with a user manual that shows them how to correctly use the solution and how it works. This reduces the risk of errors, which could be detrimental to the affected individuals./nAuthorization Concept: We have established an authorization concept based on the \"need-to-know\" principle. In this way, we can limit data security risks and at the same time ensure the proportionality of processing concerning access rights./nProcess for right of access: We have defined who is responsible for dealing with access requests. This person knows what to do./nProcess for deletion requests: We have defined who is responsible for dealing with deletion requests. This person knows what to do./nPrivacy notice: We have outlined the relevant collection and other processing of personal data in a law-compliant privacy statement./nReferences to data collection: When we collect personal data, we not only point this out to the affected individuals in the privacy notice, but also on forms, signs or other suitable ways that they can immediately recognize./nCompliance check: We have successfully had the relevant processing of personal data checked for its compliance with data protection./nISMS: We have an Information Security Management System (ISMS). This ensures that information security, especially in relation to the project and the personal data processed with it, is regularly reviewed and improved as needed./nRecords of processing activities: We enter the data in our Records of Processing Activities (ROPA) and ensure that it is updated upon changes./nRight to delete ensured: We have ensured that the personal data processed for the project can also be deleted or anonymized as far as legally required./n: /n: /n: /n: /n: /n: /n: /n: /n: /n: /n: /n: /n: /n: /n: /n: /n: /n: /n: /n: /n: /n: /n: /n: /n: /n: /n: /nOnline access control: Only authorized individuals can access the non-public personal data of the project. This is to prevent any abusive or otherwise uncontrolled use./nPhysical access control: Only authorized persons have physical access to the premises and facilities where personal data is processed. This prevents abusive or otherwise uncontrolled use./nUser authentication: We authenticate all users who want to access our systems. This helps us prevent abusive or otherwise uncontrolled use. This also serves for logging./nMFA for external access: All users who want to externally access the systems with which the relevant personal data is processed have to authenticate themselves using multi-factor authentication./nMFA for privileged accesses: All users who have elevated privileges with regard to the systems that process the personal data relevant must authenticate themselves using multi-factor authentication./nEncryption \"mobile\": We encrypt mobile data carriers (including mobile computers) that contain personal data, so that an unauthorized person cannot do anything with it./nEncryption \"at rest\": We encrypt personal data when it is stored on the systems (i.e., in a resting state). Anyone who gains access to the systems cannot do anything with the data unless they have the keys./nEncryption \"in transit\": All transfers of personal data are encrypted by us. Thus, it cannot be intercepted during transmission./nBackups: We regularly backup all personal data and periodically check it./nLogging (Basic): We record when and by whom personal data is entered, changed or disclosed (audit trails). This ensures the traceability of the processing of personal data in the solution./nData deletion mechanisms: We have ensured with appropriate functions that we generally delete or anonymize personal data that we no longer need./n: /n: /n: /n: /n: /n: /n: /n: /n: /n: /n: /n: /n: /n: /n: /n: /n: /n: /n"},{"$f":"ROW($B$128)","v":128},{"$f":"ROW($B$83)","v":83},null,null,{"$f":"ROW($B$117)","v":117},"Who?","When?","Status?",null,"Instructions"]
[null,null,null,{"$f":"ROW($A$168)","v":168},{"$f":"ROW($C$38)","v":38}]
["Note: Instructions for completing this DPIA and for the AI-assisted filling aid (optional, only in the Excel with macros) can be found at the end of this page, on the right and in the one pager and video right below. ",null,null,null,null,null,"FAQ",null,"Note: This section will not be printed and can be used for internal control of the DPIA."]
[]
["Organization (Controller):",null,"ACME Ltd.",null,null,null,null,null,null,null,null,null,"Indicate here the organization that is responsible for the project or data processing. This is the organization that defines the parameters of the processing of personal data (i.e. its purpose or means), alone or with others. In data protection terms this is the \"controller\". "]
["Department:",null,"Customer Support",null,null,null,null,null,null,null,null,null,"Here, add the area within the organization that is responsible for data processing or the project. This is not necessarily the department that technically implements the data processing."]
["Internally responsible person (owner):",null,"Emily Smith",null,null,null,null,null,null,null,null,null,"This is the person who is internally responsible for data processing or the project, i.e. the \"owner\". This is not the person who is responsible for the implementation, rather the person with the decision making power regarding the project."]
["Status of the DPIA:",null,"In progress; currently with the project manager",null,null,null,null,null,null,null,null,null,"Here, the status of the DPIA can be stated. This is deliberately a free text field that can be supplemented with further remarks."]
[]
{"$rows_left_out":213}
{"sheet":"DPIA Measure Catalog","index":1,"n_rows":107,"n_cols":8,"rows_kept":107,"cut":false,"hidden":false,"merged":[[103,0,103,7],[0,0,0,2],[98,2,98,7],[101,2,101,7],[96,0,96,2],[5,3,5,5],[55,3,55,5]]}
[{"$f":"'DPIA Main'!$A$1","v":"Data Protection Impact Assessment (DPIA)"},null,null,{"$f":"\"C\"&ROW($C$102)","v":"C102"},{"$f":"ROW($C$8)","v":8},{"$f":"ROW($C$58)","v":58}]
[{"$f":"'DPIA Main'!$A$2","v":"Version 22.9.2024 - Private Sector CH-FADP/GDPR"},null,null,null,{"$f":"ROW($C$52)","v":52},{"$f":"ROW($C$94)","v":94}]
[]
["Catalog of possible measures for the protection of affected individuals",null,null,null,null,null,null,"Back to the main sheet"]
[]
["No.","Organizational Measures","Description and effect","Mandatory as per protection level",null,null,"Selected","When to use and examples"]
[0,"(wählen)",{"$f":"\" \"","v":" "},1,2,3]
[{"$f":"IF(ISBLANK($B8),\"\",MAX($A$7:A7)+1)","v":1},"Training","We train the correct use of the solution to reduce the risk of errors in the processing of personal data.","X","X","X",{"$f":"IF(COUNTIF('DPIA Main'!$B$46:$B$83,$B8)>0,\"X\",\" \")","v":"X"},"This can be done individually, through a webinar or a standardized training."]
[{"$f":"IF(ISBLANK($B9),\"\",MAX($A$7:A8)+1)","v":2},"Instruction","We have a directive that defines the correct use of the solution, thus reducing the risk of errors in the processing of personal data, but also counteracts misuse (e.g., misappropriation).",null,null,"X",{"$f":"IF(COUNTIF('DPIA Main'!$B$46:$B$83,$B9)>0,\"X\",\" \")","v":" "},"A (binding) directive is particularly important in those cases where the personal data being processed in the solution could be misused by the employees."]
[{"$f":"IF(ISBLANK($B10),\"\",MAX($A$7:A9)+1)","v":3},"User Manual","We provide the employees with a user manual that shows them how to correctly use the solution and how it works. This reduces the risk of errors, which could be detrimental to the affected individuals.",null,"X","X",{"$f":"IF(COUNTIF('DPIA Main'!$B$46:$B$83,$B10)>0,\"X\",\" \")","v":"X"},"It can be done online or on paper, within the system or separately (e.g., through a leaflet). It differs from training in that the user can read the instructions at any time."]
{"$rows_left_out":98}
{"sheet":"DPIA Risk Catalog","index":2,"n_rows":84,"n_cols":6,"rows_kept":84,"cut":false,"hidden":false,"merged":[[0,0,0,1],[1,0,1,1],[81,0,81,3]]}
[{"$f":"'DPIA Main'!$A$1","v":"Data Protection Impact Assessment (DPIA)"},null,{"$f":"_xlfn.CONCAT($B$69:$B$78)","v":"Unauthorized access: A hacker breaches the database, steals voice prints, and impersonates numerous individuals, leading to identity theft.Data breach: Sensitive voice recordings and personal IDs are leaked online, causing significant privacy invasion and social distress.Misidentification: The AI incorrectly matches a voice print, resulting in a legitimate caller's access being denied and causing frustration and service disruption.Profiling: The voice data is misused to create detailed profiles of individuals, increasing the risk of targeted scams or harassment.System failure: The cloud-based system experiences downtime, preventing callers from being verified and disrupting call center operations.Data misuse: An employee at StarVoice Inc. abuses access to personal data to commit fraud or blackmail.Legal repercussions: Unauthorized data transfer to entities outside the agreed locations leads to legal penalties and affects data subjects’ trust.Inadequate anonymization: Voice prints stored in a non-anonymized form are correlated with other personal data, compromising personal privacy.Re-identification: Advanced algorithms re-identify anonymized voice prints with high accuracy, leading to unforeseen privacy violations.Inaccurate updates: Periodic updates to voice prints fail, causing outdated data to be used and leading to frequent and unjustified access denials for callers."},{"$f":"ROW($B$69)","v":69}]
[{"$f":"'DPIA Main'!$A$2","v":"Version 22.9.2024 - Private Sector CH-FADP/GDPR"},null,{"$f":"ROW($B$10)","v":10},{"$f":"ROW($B$78)","v":78}]
[]
["Catalogue of possible unintended negative consequences for affected individuals",null,null,"Back to the main sheet"]
[]
["General Risks"]
[]
["No.","Possible unintended  negative consequences (despite the measures)","What we can do about it","How the residual risk is generally assessed",null,"Übernehmen"]
[]
[{"$f":"A9+1","v":1},"Personal data used in the project is leaked due to an error or intentionally to unauthorized third parties. They misuse it to the detriment of the affected individuals.",null,null,{"$f":"IF(COUNTIF('DPIA Main'!$B$46:$B$83,$B10)>0,\"X\",\" \")","v":" "},"Yes"]
{"$rows_left_out":75}
{"sheet":"FAQ","index":3,"n_rows":58,"n_cols":2,"rows_kept":58,"cut":false,"hidden":false,"merged":[[0,0,0,2]]}
[{"$f":"'DPIA Main'!$A$1 & \" - FAQ\"","v":"Data Protection Impact Assessment (DPIA) - FAQ"}]
[{"$f":"'DPIA Main'!$A$2","v":"Version 22.9.2024 - Private Sector CH-FADP/GDPR"}]
[]
["1.","Do I have to carry out a data protection impact assessment for every project?"]
[]
[null,"Not by law. Data protection law only requires this for projects that are likely to pose a high risk to the affected individuals, e.g. because the data processing has certain sensitive aspects. These may be under control in the specific case because appropriate measures are being taken. However, the purpose of the DPIA is to check and ensure this. Therefore, there are companies that require a DPIA for every project - to be on the safe side. If you are not sure, ask your data protection officer or simply do a DPIA."]
[]
["2.","When I click on the buttons nothing happens."]
[]
[null,"There could be several reasons for this. First, make sure you have the file with the \".xlsm\" extension. Only this contains the necessary VBA macros to perform functions. Second, check if you can execute macros at all. Especially in companies, the execution of macros is often blocked because macros can be a security risk. Therefore, talk to your IT department. The macros in the DPIA have been digitally signed (by VISCHER AG). You can retrieve the corresponding certificate at www.rosenthal.ch to have the Excel file with its macros admitted. If you are asked when opening Excel whether the contents should be activated, confirm this. Otherwise, Excel blocks the execution of macros. Finally, for the AI functions, make sure that you have entered the API key from OpenAI or another suitable AI provider on the \"Config\" worksheet. This is needed for the use of the AI function. Finally, it is also possible that nothing happens when you press the button because the AI is not working properly and therefore does not respond to the request. In these cases, a so-called time-out error occurs after a certain time. In this case, you may want to choose a different model and try again later. If you do not want to use OpenAI, you can reconfigure the interface to work with models of other providers on the worksheet \"Config\"."]
{"$rows_left_out":49}
{"sheet":"Config","index":4,"n_rows":39,"n_cols":25,"rows_kept":39,"cut":false,"hidden":false,"merged":[[19,2,19,9],[20,2,20,9],[13,15,13,22],[17,2,17,9],[40,0,40,3],[18,2,18,9],[26,2,26,9],[26,12,26,16],[26,18,26,22],[27,2,27,3],[27,5,27,9],[27,12,27,16],[27,18,27,22],[28,2,28,9],[28,12,28,16],[28,18,28,22],[0,0,0,3],[7,2,7,9],[16,2,16,9],[10,2,10,9],[9,2,9,9],[8,2,8,9],[11,2,11,9],[12,2,12,9],[13,2,13,9],[14,2,14,9],[15,2,15,9],[28,24,28,29],[29,2,29,9],[36,13,38,19],[38,0,38,9],[30,2,30,5],[32,0,32,9],[34,0,34,9],[36,0,36,9],[36,11,36,12]]}
[{"$f":"'DPIA Main'!$A$1","v":"Data Protection Impact Assessment (DPIA)"}]
[]
["Configuration of the prompts:"]
[]
[null,"Model:","gpt-4o","(e.g. gpt-4o)"]
[null,"Temperature:",1,"(from 0-2; the higher, the more creative/random; up to 0.5 is relatively focused and deterministic)"]
[]
[null,"System:","You are a data protection expert and answer all questions briefly, specifically, and in one sentence each. You avoid repetitions and think carefully about the answer. You only suggest what is realistic. With all questions, you take into account the specific characteristics of this project.",null,null,null,null,null,null,null,null,"(a description of the project follows)"]
[null,"Ten Risks:","List ten different risk scenarios of possible damage or problems that data processing can cause for an affected person or data subject; specify the specific actual damage caused to the affected person or data subject, but do neither use the words \"risk scenario\" nor \"could\", but describe the risk as if it actually happens."]
[null,"Suggest measures:","I am specifically concerned about this risk of data processing:",null,null,null,null,null,null,null,null,"(the risk scenario on the left follows)"]
{"$rows_left_out":30}
{"sheet":"Changelog","index":5,"n_rows":12,"n_cols":2,"rows_kept":12,"cut":false,"hidden":false,"merged":[[0,0,0,3]]}
["Changelog"]
[]
["2023-09-25","First version for public comment (German)"]
["2023-10-08","Fixing a bug in the action generator; function to display error messages if the API generates such."]
["2023-10-28","Code Signing with EV Certificate (VISCHER Ltd.)"]
["2023-11-04","Some bug fixes and improvements; Translator function"]
["2023-11-26","Translator improved; further fixes"]
["2023-12-02","DPIA available also in English, added FAQ, minor fixes"]
["2023-12-04","Fixes"]
["2023-12-09","Adding Mac support (before Excel 2016, using MacScript) - untested"]
{"$rows_left_out":2}