{"text_format":"1","workbook":"xlsx","n_sheets":6,"sheets":["DSFA Hauptblatt","DSFA Massnahmenkatalog","DSFA Risikokatalog","FAQ","Config","Changelog"],"not_rendered":{"charts":0,"images":4,"macros":1,"external_links":0,"defined_names":7,"comments":0,"pivot_tables":0},"unopened":[],"bounds":{"document_bytes":16777216,"sheet_cells":100000,"rows_first":2000,"rows_last":500,"rows_between":2000,"halvings":0,"cell_chars":16384,"cell_head_chars":4096},"cells_cut":0,"cells_raw":0,"read":"whole","date_system":"1900"}

{"sheet":"DSFA Hauptblatt","index":0,"n_rows":222,"n_cols":20,"rows_kept":222,"cut":false,"hidden":false,"merged":[[171,1,172,1],[214,12,217,12],[215,0,215,5],[125,5,126,5],[207,2,207,5],[204,2,204,5],[210,2,210,5],[214,0,214,6],[177,1,178,1],[179,1,180,1],[181,1,182,1],[177,3,177,6],[178,3,178,6],[179,3,179,6],[217,0,217,6],[181,3,181,6],[182,3,182,6],[218,0,218,6],[0,0,0,1],[6,2,6,3],[5,2,5,3],[205,2,205,5],[206,2,206,5],[23,2,23,5],[24,2,24,5],[25,2,25,5],[29,2,29,5],[30,2,30,5],[7,2,7,3],[8,2,8,3],[21,2,21,5],[1,0,1,1],[17,2,17,5],[18,2,18,5],[20,2,20,5],[180,3,180,6],[3,8,3,10],[12,2,12,3],[10,2,10,3],[16,2,16,5],[19,2,19,5],[22,2,22,5],[121,12,125,12],[125,4,126,4],[37,12,40,12],[35,12,36,12],[39,3,41,4],[189,2,189,3],[190,2,190,3],[191,2,191,3],[192,2,192,3],[193,2,193,3],[194,2,194,3],[195,2,195,3],[196,2,196,3],[197,2,197,3],[198,2,198,3]]}
["Datenschutz-Folgenabschätzung (DSFA)",null,{"$f":"_xlfn.CONCAT($B$128:$B$168)","v":"Personendaten des Vorhabens gelangen wegen eines Fehlers oder absichtlich an unbefugte Dritte. Diese missbrauchen sie zum Schaden der betroffenen Personen.Personendaten des Vorhabens gelangen wegen eines Fehlers oder absichtlich an eine unbefugte interne Person. Diese missbraucht sie zum Schaden der betroffenen Personen.Personendaten des Vorhabens werden versehentlich ganz oder teilweise gelöscht. Dies führt zu einem Nachteil für die betroffenen Personen.Personendaten des Vorhabens werden von einem Angreifer ganz oder teilweise gelöscht. Dies führt zu einem Nachteil für die betroffenen Personen.Die Lösung bzw. die Systeme, mit welcher wir die Personendaten des Vorhabens bearbeiten, erlaubt uns nicht mehr auf die Daten zuzugreifen oder sie sonst zu bearbeiten. Dies führt zu einem Nachteil für die betroffenen Personen.Personendaten des Vorhabens werden von einem externen Angreifer manipuliert, was wir aber nicht sofort merken und was wiederum zu einem Nachteil für die betroffenen Personen führt.Personendaten des Vorhabens werden von einem internen Angreifer manipuliert, was wir aber nicht sofort merken und was wiederum zu einem Nachteil für die betroffenen Personen führt.Personendaten des Vorhabens werden aufgrund eines Fehlers in der Lösung, des Systems oder der Bedienung nicht aktualisiert, teilweise gelöscht oder sonst verfälscht, was wir aber nicht sofort merken und was wiederum zu einem Nachteil für die betroffenen Personen führt.Die betroffenen Personen realisieren nicht, dass wir ihre Personendaten erheben bzw. was wir damit tun. Diese mangelnde Transparenz führt zu einem Unwohlsein dieser Personen und anderen Nachteilen für diese.Personendaten des Vorhabens werden gegenüber unserer ursprünglichen Kommunikation durch uns zweckentfremdet verwendet, was zu einem Unwohlsein der davon betroffenen Personen und anderen Nachteilen für diese führt.Personendaten des Vorhabens werden entgegen den Regeln durch einen Dritten zweckentfremdet verwendet, was zu einem Unwohlsein der davon betroffenen Personen und anderen Nachteilen für diese führt.Es gelingt uns nicht, einer betroffenen Person auf ihre Anfrage hin in der erforderlichen Weise Auskunft über ihre hier relevanten Personendaten und die weiteren Punkte zu erteilen, die sie von uns erfragen darf. In der Folge kann sie ihre gesetzlichen Rechte zur Sicherstellung ihres Datenschutzes nicht richtig durchsetzen.Es gelingt uns nicht, auf den Wunsch einer betroffenen Person hin deren Daten zu löschen, obwohl wir dies tun müssten. Dies führt zu einem Unwohlsein der davon betroffenen Personen und anderen Nachteile für diese.Es gelingt uns nicht, auf den Wunsch einer betroffenen Person hin deren Daten zu berichtigen, obwohl wir dies tun müssten. Dies führt zu einem Unwohlsein der davon betroffenen Personen und anderen Nachteile für diese, weil wir falsche bzw. unvollständige Daten über sie bearbeiten.Es gelingt uns nicht, nicht mehr benötigte Personendaten zu löschen. Dies führt dazu, dass sie weiterhin zum Schaden der betroffenen Personen missbraucht werden oder in die Hände unbefugter Personen fallen können, mit allen Folgen eines solchen Vorfalls.Unsere Datenbearbeitung weist Fehler oder Lücken auf. Dies führt dazu, dass betroffene Personen finanzielle Schäden oder Nachteile erleiden. Unsere Datenbearbeitung weist Fehler oder Lücken auf. Dies führt dazu, dass betroffenen Personen unerwünschter Weise Leistungen verweigert werden."},{"$f":"ROW($B$128)+((MAX($A$127:$A$168)-4)*100)","v":144.99999999999963},{"$f":"ROW($B$46)","v":46},{"$f":"\"Was geplant ist: \"&$C$18&\"\\n Geschäftsprozess oder Geschäftsbereich: \"&$C$17&\"\\n Welche Ziele und Interessen verfolgt werden: \"&$C$19&\"\\n Betroffene Personen: \"&$C$23&\"\\n Kategorien von Daten: \"&$C$22&\"\\n Verwendete Mittel und Techniken: \"&$C$20&\"\\n Beteiligte Stellen und Provider: \"&$C$21&\"\\n Orte der Datenbearbeitung: \"&$C$24&\"\\n Besonderheiten: \"&$C$26","v":"Was geplant ist: Es geht um Stimmerkennung: Alle Gespräche werden aufgezeichnet und von einer KI verarbeitet. Der Stimmabdruck wird dann in einer Datenbank abgelegt. Bei jedem Anruf wird erneut ein Stimmabdruck hergestellt und dieser mit dem abgelegten Stimmabdruck abgeglichen. Dem Call-Center-Agent wird angezeigt, ob er übereinstimmt.\\n Geschäftsprozess oder Geschäftsbereich: Behandlung von Anrufen im Call Center\\n Welche Ziele und Interessen verfolgt werden: Mit dem Stimmabdruck soll die Identität von Anrufern im Call-Center verifiziert und so die Sicherheit erhöht werden.\\n Betroffene Personen: Anrufer\\n Kategorien von Daten: Stimmabdruck, ID der Person, Tonaufnahmen\\n Verwendete Mittel und Techniken: Es kommt eine Standardlösung des US-Herstellers StarVoice Inc. zum Einsatz, die wir in der Cloud hier in der Schweiz betreiben.\\n Beteiligte Stellen und Provider: Die Lösung läuft auf Microsoft Azure von Micrsoft Ireland Operations Ltd. Andere Dritte sind nicht involviert.\\n Orte der Datenbearbeitung: Schweiz\\n Besonderheiten: "},{"$f":"$C$18&\"(\"&$C$17&\")\"","v":"Es geht um Stimmerkennung: Alle Gespräche werden aufgezeichnet und von einer KI verarbeitet. Der Stimmabdruck wird dann in einer Datenbank abgelegt. Bei jedem Anruf wird erneut ein Stimmabdruck hergestellt und dieser mit dem abgelegten Stimmabdruck abgeglichen. Dem Call-Center-Agent wird angezeigt, ob er übereinstimmt.(Behandlung von Anrufen im Call Center)"},{"$f":"ROW($B$89)","v":89}]
["Version 17.12.2023 - Private Institutionen CH-DSG/DSGVO",null,{"$f":"_xlfn.CONCAT($G$46:$G$83)&_xlfn.CONCAT($G$89:$G$117)","v":"Schulung: Wir schulen den korrekten Einsatz der Lösung, um das Risiko von Fehlern in der Bearbeitung der Personendaten zu reduzieren. /nBenutzeranleitung: Wir geben den Mitarbeitenden eine Benutzeranleitung, die ihnen zeigt, wie sie die Lösung korrekt benutzen und wie diese funktioniert. Dies reduziert das Risiko von Fehlern, welche für betroffene Personen nachteilig sein könnten./nBerechtigungskonzept: Wir haben ein Berechtigungskonzept nach dem \"Need-to-Know\"-Prinzip festgelegt. Auf diese Weise können wir Datensicherheitsrisiken begrenzen und zugleich die Verhältnismässigkeit der Bearbeitung betreffend Zugriffsberechtigte sicherstellen./nProzess für Auskunftsrecht: Wir haben definiert, wer für Auskunftsbegehren verantwortlich ist. Diese Person weiss, was zu tun ist./nProzess für Löschgesuche: Wir haben definiert, wer für Löschgesuche verantwortlich ist. Diese Person weiss, was zu tun ist./nDatenschutzerklärung: Wir haben die hier relevante Erhebung und sonstige Bearbeitung von Personendaten in einer Gesetzes-konformen Datenschutzerklärung dargelegt./nHinweise auf die Datenerhebung: Wenn wir Personendaten erheben, weisen wir die betroffenen Personen nicht nur in der Datenschutzerklärung darauf hin, sondern auch auf Formularen, Schildern oder andere geeignete Weise, die sie sofort erkennen können./nCompliance-Check: Wir haben die hier relevante Bearbeitung von Personendaten auf ihre Datenschutzkonformität erfolgreich prüfen lassen. /nISMS: Wir haben ein Management-System für Informationssicherheit (ISMS). Damit stellen wir sicher, dass die Informationssicherheit auch in Bezug auf das Vorhaben und die damit bearbeiteten Personendaten regelmässig überprüft und bei Bedarf nachgebessert wird./nBearbeitungsverzeichnis: Wir nehmen die Datenbearbeitung in unserem Bearbeitungsverzeichnis auf und stellen sicher, dass es bei Änderungen aktualisiert wird. /nLöschrecht sichergestellt: Wir haben dafür gesorgt, dass die für das Vorhaben bearbeiteten Personendaten soweit gesetzlich erforderlich auch gelöscht oder anonymisiert werden können. /n: /n: /n: /n: /n: /n: /n: /n: /n: /n: /n: /n: /n: /n: /n: /n: /n: /n: /n: /n: /n: /n: /n: /n: /n: /n: /n: /nZugriffskontrolle: Nur berechtigte Personen können auf die nicht-öffentlichen Personendaten des Vorhabens zugreifen. Damit wirken wir einer missbräuchlichen oder sonst unkontrollierten Nutzung entgegen./nZugangskontrolle: Nur berechtigte Personen haben einen physischen Zugang zu den Räumlichkeiten und Anlagen, in denen Personendaten bearbeitet werden. Damit verhindern wir eine missbräuchliche oder sonst unkontrollierte Nutzung./nBenutzerkontrolle: Wir authentifizieren alle Benutzer, die auf unsere Systeme zugreifen wollen. Damit wirken wir einer missbräuchlichen oder sonst unkontrollierten Nutzung entgegen. Dies dient auch der Protokollierung./nMFA für externe Zugriffe: Alle Benutzer, die von extern auf die Systeme zugreifen wollen, mit denen die hier relevaten Personendaten bearbeitet werden, müssten sich mittels einer Multi-Faktor-Authentisierung authentisieren./nMFA für privilegierte Zugriffe: Alle Benutzer, die erhöhte Privilegien im Hinblick auf die Systeme haben, mit denen die hier relevaten Personendaten bearbeitet werden, müssten sich mittels einer Multi-Faktor-Authentisierung authentisieren./nVerschlüsselung \"mobil\": Wir verschlüsseln mobile Datenträger (inkl. mobile Computer), welche die Personendaten enthalten, so dass eine unbefugte Person damit nichts anfangen kann./nVerschlüsselung \"at rest\": Wir verschlüsseln die Personendaten, wenn sie auf unseren Systemen gespeichert sind (d.h. im ruhenden Zustand). Wer an die Systeme gelangt, kann so nichts mit den Daten anfangen./nVerschlüsselung \"in transit\": Die Übermittlung von Personendaten erfolgt bei uns verschlüsselt. Sie können so während der Übermittlung nicht abgehört werden./nBackups: Wir machen regelmässig Backups aller Personendaten und kontrollieren diese periodisch./nProtokollierung (Basis): Wir protokollieren, wann von wem Personendaten eingegeben, verändert oder bekanntgegeben  werden.  Dies stellt die Nachvollziehbarkeit der Bearbeitung der Personendaten in der Lösung sicher./nDatenlöschungsfunktionen: Wir haben mit entsprechenden Funktionen dafür gesorgt, dass wir nicht mehr benötigte Personendaten grundsätzlich löschen oder anonymisieren./n: /n: /n: /n: /n: /n: /n: /n: /n: /n: /n: /n: /n: /n: /n: /n: /n: /n: /n"},{"$f":"ROW($B$128)","v":128},{"$f":"ROW($B$83)","v":83},null,null,{"$f":"ROW($B$117)","v":117},"Wer?","Wann?","Status?",null,"Anleitung"]
[null,null,null,{"$f":"ROW($A$168)","v":168},{"$f":"ROW($C$38)","v":38}]
["Hinweis: Eine Anleitung zum Ausfüllen dieser DSFA und zur KI-gestützten Ausfüllhilfe (optional, nur in der Version des Excels mit Makros) findet sich am Ende dieses Blatts, rechts sowie im One-Pager/Tutorial unten.",null,null,null,null,null,"FAQ",null,"Hinweis: Dieser Teil wird nicht ausgedruckt und kann zur internen Steuerung der DSFA benutzt werden."]
[]
["Unternehmen (Verantwortlicher):",null,"Musterfirma AG",null,null,null,null,null,null,null,null,null,"Hier ist anzugeben, welches Unternehmen für das Vorhaben bzw. die Datenbearbeitung verantwortlich zeichnet. Es geht um dasjenige Unternehmen, das die datenschutzrechtlichen Rahmenbedingungen der Datenbearbeitung festlegt, allenfalls zusammen mit anderen. Im Datenschutz ist dies der \"Verantwortliche\" oder \"Controller\". "]
["Abteilung:",null,"Customer Support",null,null,null,null,null,null,null,null,null,"Hier sollte der innerhalb des Unternehmens für die Datenbearbeitung bzw. das Vorhaben verantwortliche Bereich angegeben werden. Das ist nicht zwingend die Stelle, die die Datenbearbeitung implementiert."]
["Verantwortlich intern:",null,"Bettina Bauer",null,null,null,null,null,null,null,null,null,"Dies ist die Person, die intern für die Datenbearbeitung bzw. das Vorhaben verantwortlich ist, also dessen \"Eigner\". Es ist wiederum nicht die Person, die für die Implementierung verantwortlich ist, sondern jene Person, die entscheidet."]
["Status der DSFA:",null,"In Arbeit; derzeit bei der Projektverantwortlichen",null,null,null,null,null,null,null,null,null,"Hier kann der Status der DSFA beschrieben werden. Dies ist bewusst ein Freitext-Feld, das mit weiteren Bemerkungen versehen werden kann."]
[]
{"$rows_left_out":213}
{"sheet":"DSFA Massnahmenkatalog","index":1,"n_rows":106,"n_cols":8,"rows_kept":106,"cut":false,"hidden":false,"merged":[[103,0,103,7],[0,0,0,2],[98,2,98,7],[101,2,101,7],[96,0,96,2],[5,3,5,5],[55,3,55,5]]}
[{"$f":"'DSFA Hauptblatt'!$A$1","v":"Datenschutz-Folgenabschätzung (DSFA)"},null,null,{"$f":"\"C\"&ROW($C$102)","v":"C102"},{"$f":"ROW($C$8)","v":8},{"$f":"ROW($C$58)","v":58}]
[{"$f":"'DSFA Hauptblatt'!$A$2","v":"Version 17.12.2023 - Private Institutionen CH-DSG/DSGVO"},null,null,null,{"$f":"ROW($C$52)","v":52},{"$f":"ROW($C$94)","v":94}]
[]
["Katalog möglicher Massnahmen zum Schutz der betroffenen Personen",null,null,null,null,null,null,"Zurück zum Hauptblatt"]
[]
["Nr.","Organisatorische Massnahmen","Beschreibung und Wirkung","Zwingend gem. Schutzstufe",null,null,"Gewählt","Wann verwenden und Beispiele"]
[0,"(wählen)",{"$f":"\" \"","v":" "},1,2,3]
[{"$f":"IF(ISBLANK($B8),\"\",MAX($A$7:A7)+1)","v":1},"Schulung","Wir schulen den korrekten Einsatz der Lösung, um das Risiko von Fehlern in der Bearbeitung der Personendaten zu reduzieren. ","X","X","X",{"$f":"IF(COUNTIF('DSFA Hauptblatt'!$B$46:$B$83,$B8)>0,\"X\",\" \")","v":"X"},"Dies kann individuell, durch ein Webinar oder eine standardisierte Schulung erfolgen."]
[{"$f":"IF(ISBLANK($B9),\"\",MAX($A$7:A8)+1)","v":2},"Weisung","Wir haben eine Weisung, die den korrekten Einsatz der Lösung definiert und auf diese Weise das Risiko von Fehlern in der Bearbeitung der Personendaten senkt, aber auch einem Missbrauch (z.B. zweckentfremdete Nutzung) entgegenwirkt.",null,null,"X",{"$f":"IF(COUNTIF('DSFA Hauptblatt'!$B$46:$B$83,$B9)>0,\"X\",\" \")","v":" "},"Eine Weisung ist besonders in jenen Fällen wichtig, in denen die Personendaten, die in der Lösung bearbeitet werden, von den Mitarbeitenden zweckentfremdet werden könnten."]
[{"$f":"IF(ISBLANK($B10),\"\",MAX($A$7:A9)+1)","v":3},"Benutzeranleitung","Wir geben den Mitarbeitenden eine Benutzeranleitung, die ihnen zeigt, wie sie die Lösung korrekt benutzen und wie diese funktioniert. Dies reduziert das Risiko von Fehlern, welche für betroffene Personen nachteilig sein könnten.",null,"X","X",{"$f":"IF(COUNTIF('DSFA Hauptblatt'!$B$46:$B$83,$B10)>0,\"X\",\" \")","v":"X"},"Sie kann online oder auf Papier, im System oder separat erfolgen (z.B. durch ein Merkblatt). Sie unterscheidet sich von der Schulung darin, dass der Benutzer die Anleitung jederzeit lesen kann."]
{"$rows_left_out":97}
{"sheet":"DSFA Risikokatalog","index":2,"n_rows":84,"n_cols":6,"rows_kept":84,"cut":false,"hidden":false,"merged":[[0,0,0,1],[1,0,1,1],[81,0,81,3]]}
[{"$f":"'DSFA Hauptblatt'!$A$1","v":"Datenschutz-Folgenabschätzung (DSFA)"},null,{"$f":"_xlfn.CONCAT($B$69:$B$78)","v":"Der Stimmabdruck einer betroffenen Person wird fälschlicherweise mit einem anderen Stimmabdruck verwechselt, was dazu führt, dass der Anrufer nicht erkannt wird und ihm der Zugang zu seinem Anliegen im Call-Center verwehrt wird.Die gespeicherten Tonaufnahmen werden versehentlich gelöscht, wodurch eine betroffene Person Beweise für ein wichtiges Telefonat verliert.Der abgelegte Stimmabdruck einer betroffenen Person wird gehackt und von Dritten für betrügerische Zwecke verwendet, wie beispielsweise Identitätsdiebstahl oder Telefonbetrug.Die gespeicherten Tonaufnahmen werden ohne Einwilligung der betroffenen Person an Dritte weitergegeben, wodurch ihre Privatsphäre verletzt wird.Die KI zur Stimmerkennung weist eine hohe Fehlerquote auf und erkennt die betroffene Person wiederholt nicht, was zu wiederholten Sicherheitsüberprüfungen und Frust bei der Identitätsverifizierung führt.Der Provider des Systems erleidet einen Datenverlust und die abgelegten Stimmabdrücke aller betroffenen Personen gehen verloren, was zu einem Vertrauensverlust und dazu führt, dass Anrufer nicht mehr erkannt werden.Die abgelegten Stimmabdrücke werden von einer unbefugten Person manipuliert, um ihre eigene Identität zu verschleiern, und dadurch wird es für betroffene Personen schwierig, ihre Identität im Call-Center zu bestätigen.Die Stimmabdrücke werden in einem ungesicherten Server gespeichert und sind anfällig für Hacking-Angriffe, wodurch die betroffenen Personen einem erhöhten Risiko von Identitätsdiebstahl ausgesetzt sind.Durch ein technisches Versagen werden die abgelegten Stimmabdrücke mit falschen Daten verknüpft, wodurch die Identität einer betroffenen Person verwechselt wird und sie Zugriff auf sensible Informationen erhält, die nicht für sie bestimmt sind.Die Stimmabdrücke werden für andere Zwecke, wie Werbung oder Forschung, verwendet, ohne dass die betroffenen Personen darüber informiert und um ihre Einwilligung gebeten wurden, was zu einer unerwünschten Nutzung ihrer persönlichen Daten führt."},{"$f":"ROW($B$69)","v":69}]
[{"$f":"'DSFA Hauptblatt'!$A$2","v":"Version 17.12.2023 - Private Institutionen CH-DSG/DSGVO"},null,{"$f":"ROW($B$10)","v":10},{"$f":"ROW($B$78)","v":78}]
[]
["Katalog von möglichen unerwünschten negativen Folgen für betroffene Personen",null,null,"Zurück zum Hauptblatt"]
[]
["Allgemeine Risiken"]
[]
["Nr.","Mögliche unerwünschte negativen Folgen (trotz der Massnahmen)","Was wir dagegen tun können","Wie das Restrisiko allgemein einzuschätzen ist",null,"Übernehmen"]
[]
[{"$f":"A9+1","v":1},"Personendaten des Vorhabens gelangen wegen eines Fehlers oder absichtlich an unbefugte Dritte. Diese missbrauchen sie zum Schaden der betroffenen Personen.",null,null,{"$f":"IF(COUNTIF('DSFA Hauptblatt'!$B$46:$B$83,$B10)>0,\"X\",\" \")","v":" "},"Ja"]
{"$rows_left_out":75}
{"sheet":"FAQ","index":3,"n_rows":58,"n_cols":2,"rows_kept":58,"cut":false,"hidden":false,"merged":[[0,0,0,2]]}
[{"$f":"'DSFA Hauptblatt'!$A$1 & \" - FAQ\"","v":"Datenschutz-Folgenabschätzung (DSFA) - FAQ"}]
[{"$f":"'DSFA Hauptblatt'!$A$2","v":"Version 17.12.2023 - Private Institutionen CH-DSG/DSGVO"}]
[]
["1.","Muss ich für jedes Vorhaben eine Datenschutz-Folgenabschätzung durchführen?"]
[]
[null,"Von Gesetzes wegen nicht. Das Datenschutzrecht verlangt dies nur bei Vorhaben, die mutmasslich zu einem hohen Risiko für die betroffenen Personen führen können, z.B. weil die Datenbearbeitung bestimmte heikle Aspekte aufweist. Diese sind möglicherweise im konkreten Fall \"im Griff\", weil entsprechende Massnahmen getroffen werden. Bei der DSFA geht es aber gerade darum, dies zu überprüfen und sicherzustellen. Es gibt darum Unternehmen, die eine DSFA für jedes Vorhaben verlangen - um auf Nummer sicher zu gehen. Wer nicht sicher ist, fragt die Datenschutzstelle oder macht einfach eine DSFA."]
[]
["2.","Wenn ich auf die Schaltflächen klicke passiert nichts."]
[]
[null,"Das kann mehrere Gründe haben. Stellen Sie zuerste sicher, dass Sie die Datei mit der Endung \".xlsm\" haben. Nur diese enthält die nötigen VBA-Makros um Funktionen auszuführen. Prüfen Sie zweitens, ob Sie Makros überhaupt ausführen können. Vor allem in Unternehmen ist das Ausführen von Makros oft gesperrt, weil Makros ein Sicherheitsrisiko sein können. Sprechen Sie daher mit Ihrer IT-Abteilungen. Die Makros in der DSFA sind digital signiert worden (von VISCHER AG). Sie können das dazugehörige Zertifikat auf www.rosenthal.ch abrufen, um so die DSFA (und weitere Produkte von VISCHER) freizuschalten. Wenn Sie beim Öffnen des Excel ferner gefragt werden, ob die Inhalte aktiviert werden sollen, bestätigen Sie dies. Sonst sperrt Excel das Ausführen der Makros. Schliesslich müssen Sie für die KI-Funktionen darauf achten, dass Sie auf dem Arbeitsblatt \"Config\" den API-Key von OpenAI eingetragen haben. Den braucht es für die Nutzung der KI-Funktion. Schliesslich ist es noch möglich, dass beim Knopfdruck nichts passiert, weil die KI nicht richtig funktioniert und daher auf die Anfrage nicht reagiert. Es kommt in diesen Fällen nach einer gewissen Zeit zu einem sog. Time-out-Fehler. In diesem Fall ggf. ein anderes Modell wählen und es später nochmals probieren."]
{"$rows_left_out":49}
{"sheet":"Config","index":4,"n_rows":27,"n_cols":12,"rows_kept":27,"cut":false,"hidden":false,"merged":[[30,0,30,3],[24,0,24,13],[0,0,0,3],[23,0,23,13],[7,2,7,9],[16,2,16,9],[10,2,10,9],[9,2,9,9],[8,2,8,9],[11,2,11,9],[12,2,12,9],[13,2,13,9],[14,2,14,9],[15,2,15,9],[18,2,18,9],[19,2,19,9],[20,2,20,9],[4,2,4,9],[13,15,13,22],[17,2,17,9]]}
[{"$f":"'DSFA Hauptblatt'!$A$1","v":"Datenschutz-Folgenabschätzung (DSFA)"}]
[]
["Konfiguration für OpenAI-GPT-Schnittstelle:"]
[]
[null,"API-Key:",null,null,null,null,null,null,null,null,null,"API keys - OpenAI API"]
[null,"Modell:","gpt-3.5-turbo","  (z.B. \"gpt-3.5-turbo\"; \"gpt-4\" oder \"gpt-4-1106-preview\")",null,null,null,null,null,null,null,"Models - OpenAI API"]
[null,"Temperatur:",1,"  (von 0-2; je höher, desto kreativer/zufällig; bis 0.5 ist relativ fokussiert und deterministisch)"]
[null,"System:","Vergiss, was wir bisher besprochen haben. Du bist ein Datenschutzexperte und antwortest auf alle Fragen kurz, konkret und jeweils in einem Satz. Du vermeidest Wiederholungen und denkst über die Antwort genau nach. Du schlägst nur Dinge vor, die realistisch sind. Bei allen Fragen berücksichtigst Du die spezifischen Eigenheiten dieses Projekts: ",null,null,null,null,null,null,null,null,"(es folgt eine Beschreibung des Vorhabens)"]
[null,"Zehn Risiken:","Zähle mir zehn verschiedene Risiko-Szenarien eines möglichen Schadens oder Problems auf, welches die Datenbearbeitung für eine betroffene Person verursachen kann; verwende nicht \"Ein mögliches Risiko\" oder \"könnte\", sondern beschreibe nur das Risiko und bezeichne den konkreten Schaden für die betroffene Person."]
[null,"Massnahmen vorschlagen:","Es geht mir konkret nur um dieses Risiko dieser Datenbearbeitung: ",null,null,null,null,null,null,null,null,"(es folgt das Risiko-Szenario links)"]
{"$rows_left_out":18}
{"sheet":"Changelog","index":5,"n_rows":11,"n_cols":2,"rows_kept":11,"cut":false,"hidden":false,"merged":[[0,0,0,3]]}
["Changelog"]
[]
["2023-09-25","Erste Version for public comment."]
["2023-10-08","Behebung eines Bugs beim Massnahmengenerator; Funktion zur Darstellung von Fehlermeldungen, falls die API solche generiert."]
["2023-10-28","Code Signing mit EV-Zertifikat (VISCHER Ltd.)"]
["2023-11-04","Einige Bugfixes und Verbesserungen; Translator-Funktion"]
["2023-11-26","Translator verbessert; weitere Fixes"]
["2023-12-02","Englische Version; FAQ; weitere Fixes"]
["2023-12-04","Fixes"]
["2023-12-09","Mit Mac support (vor Excel 2016, mit MacScript) - ungetested"]
{"$rows_left_out":1}